{"text_format":"1","workbook":"xlsx","n_sheets":6,"sheets":["SOLICITAÇÃO","MEMORIAL DESCRITIVO","REPASSE ","Plan2","Cor - Versões - Código de Barra","PLANO DE ENSAIO"],"not_rendered":{"charts":0,"images":4,"macros":1,"external_links":1,"defined_names":66,"comments":0,"pivot_tables":0},"unopened":[],"bounds":{"document_bytes":16777216,"sheet_cells":100000,"rows_first":2000,"rows_last":500,"rows_between":2000,"halvings":0,"cell_chars":16384,"cell_head_chars":4096},"cells_cut":0,"cells_raw":0,"read":"whole","date_system":"1900"}

{"sheet":"SOLICITAÇÃO","index":0,"n_rows":51,"n_cols":4,"rows_kept":51,"cut":false,"hidden":false,"merged":[[46,3,46,4],[47,2,47,4],[48,2,48,4],[50,2,50,4],[49,3,49,4],[33,2,33,4],[34,2,34,4],[35,2,35,4],[36,2,36,4],[37,2,37,4],[43,1,43,4],[38,3,38,4],[39,3,39,4],[40,3,40,4],[41,2,41,4],[32,2,32,4],[19,2,19,4],[20,2,20,4],[21,2,21,4],[22,2,22,4],[24,1,24,4],[26,2,26,4],[27,2,27,4],[28,2,28,4],[29,2,29,4],[30,2,30,4],[31,2,31,4],[18,2,18,4],[1,1,1,4],[8,1,8,4],[10,2,10,4],[11,2,11,4],[12,2,12,4],[13,2,13,4],[14,2,14,4],[15,2,15,4],[16,2,16,4],[17,2,17,4],[5,1,5,4],[6,1,6,4]]}
[]
[null,"                                \n                                 ANÁLISE DE VIABILIDADE - BERÇO\n                 \n                               "]
[]
[null,"SOLICITAÇÃO:","-"]
[null,"MODELO DE CERTIFICAÇÃO:","-"]
[null,{"$f":"IF(C5=\"MODELO 2\",\" - Somente podem solicitar a certificação com base no Modelo de Certificação 2 os fabricantes de berços infantis que comprovem sua classificação como MPE\",\"\")","v":""}]
[null,{"$f":"IF(C5=\"MODELO 2\",\" - A opção pelo Modelo de Certificação 2 não se aplica aos importadores, comerciantes ou distribuidores de berços infantis, limitando-se aos fabricantes localizados em todo o território nacional.\",\"\")","v":""}]
[]
[null,"DADOS DA EMPRESA SOLICITANTE"]
[]
[null,"RAZÃO SOCIAL:","-"]
[null,"NOME FANTASIA:"]
[null,"CNPJ:","-"]
[null,"ENDEREÇO:","-"]
[null,"BAIRRO:","-"]
[null,"CEP:","-"]
[null,"CIDADE:","-"]
[null,"ESTADO:","-"]
[null,"E-MAIL:","-"]
[null,"NOME DO CONTATO:","-"]
[null,"TELEFONE: (   )","-"]
[null,"DATA DA SOLICITAÇÃO:","-"]
[null,null,"______________________________________________________________________\nAssinatura (obrigatório)"]
[]
[null,"DADOS DA FÁBRICA"]
[]
[null,"RAZÃO SOCIAL:","-"]
[null,"NOME FANTASIA:"]
[null,"CNPJ:","-"]
[null,"ENDEREÇO:","-"]
[null,"BAIRRO:","-"]
[null,"CEP:","-"]
[null,"CIDADE:","-"]
[null,"ESTADO:","-"]
[null,"PAÍS:","-"]
[null,"E-MAIL - FÁBRICA:","-"]
[null,"NOME DO CONTATO FÁBRICA:","-"]
[null,"TELEFONE (DDD) XXXXX-XXXX:","-"]
[null,"PROCEDÊNCIA: ","-"]
[null,"PAÍS DE ORIGEM:","-"]
[null,"POSSUI CERTIFICAÇÃO ISO 9001? (vigente)","-",{"$f":"IF(C41=\"SIM\",\"Enviar certificado com validade vigente via e-mail\",\"\")","v":""}]
[null,{"$f":"IF(C41=\"sim\",\"DESCREVA O ESCOPO DE CERTIFICAÇÃO\",\"\")","v":""},"-"]
[]
[null,"IDENTIFICAÇÃO DOS PRODUTOS"]
[]
[null,"PRODUTO COM MÚLTIPLAS CERTIFICAÇÕES (PRODUTO HÍBRIDO)?","-",{"$f":"IF(C46=\"SIM\",\"QUAL(IS)\",\"\")","v":""}]
[null,"POSSUI LICENÇA DE TERCEIROS?\n(USO DE MARCA): ","-",{"$f":"IF(C47=\"SIM\",\"Favor preencher as duas linhas abaixo\",\"\")","v":""}]
[null,{"$f":"IF(C47=\"SIM\",\"PRODUTOS LICENCIADOS:\",\"\")","v":""},"-"]
[null,{"$f":"IF(C47=\"SIM\",\"N° DA LICENÇA P/ USO DE MARCAS:\",\"\")","v":""},"-"]
[null,"EXISTE PROCESSO TERCEIRIZADO:","-"]
[null,{"$f":"IF(C50=\"SIM\",\"QUAL?\",\"\")","v":""}]

{"sheet":"MEMORIAL DESCRITIVO","index":1,"n_rows":105,"n_cols":15,"rows_kept":105,"cut":false,"hidden":false,"merged":[[31,1,31,2],[103,4,103,8],[103,10,103,14],[104,10,104,14],[104,4,104,8],[9,1,9,2],[9,4,9,5],[9,7,9,8],[9,10,9,11],[9,13,9,14],[75,10,75,14],[69,10,69,14],[70,10,70,14],[71,10,71,14],[72,10,72,14],[73,10,73,14],[66,10,66,14],[66,1,66,4],[67,1,67,4],[76,1,76,4],[68,1,68,4],[77,1,77,4],[74,1,74,4],[75,1,75,4],[69,1,69,4],[8,1,8,2],[8,4,8,5],[8,7,8,8],[8,10,8,11],[8,13,8,14],[49,1,49,14],[51,11,60,14],[90,2,99,2],[90,10,99,10],[90,11,99,14],[90,4,99,4],[90,5,99,8],[88,1,88,14],[51,6,60,9],[66,5,66,9],[67,5,67,9],[76,5,76,9],[77,5,77,9],[68,5,68,9],[74,5,74,9],[74,10,74,14],[75,5,75,9],[68,10,68,14],[77,10,77,14],[73,1,73,4],[51,1,60,1],[51,2,60,5],[62,1,62,14],[67,10,67,14],[76,10,76,14],[64,1,64,14],[69,5,69,9],[70,5,70,9],[71,5,71,9],[72,5,72,9],[73,5,73,9],[51,10,60,10],[39,11,39,14],[42,11,42,14],[44,11,44,14],[43,11,43,14],[42,3,42,4],[41,3,41,4],[70,1,70,4],[71,1,71,4],[72,1,72,4],[82,16,86,17],[82,4,83,8],[85,4,86,8],[79,1,79,14],[82,9,86,9],[82,10,86,11],[81,4,81,8],[84,4,84,8],[81,10,81,11],[81,13,81,14],[81,1,86,1],[82,2,83,2],[85,2,86,2],[82,12,86,12],[82,13,86,14],[28,0,33,0],[28,1,28,2],[29,1,29,2],[30,1,30,2],[32,1,32,2],[33,1,33,2],[28,7,30,14],[32,5,32,8],[32,11,32,14],[33,5,33,8],[33,11,33,14],[11,1,11,14],[13,1,14,1],[13,4,14,4],[13,7,14,7],[13,10,14,10],[13,13,14,13],[19,1,20,1],[19,4,20,4],[26,1,26,14],[19,7,20,7],[1,1,1,14],[3,1,3,2],[3,4,3,8],[4,1,4,2],[4,4,4,8],[5,1,5,2],[5,4,5,8],[6,1,6,2],[6,4,6,8],[101,4,101,8],[101,10,101,14],[102,4,102,8],[102,10,102,14],[19,10,20,10],[19,13,20,13],[16,1,17,1],[16,4,17,4],[16,7,17,7],[16,10,17,10],[16,13,17,13],[35,1,35,14],[90,1,99,1],[46,3,46,4],[47,3,47,4],[43,3,43,4],[44,3,44,4],[47,11,47,14],[46,11,46,14],[45,11,45,14],[45,3,45,4],[40,3,40,4],[41,11,41,14],[40,11,40,14]]}
[]
[null,"IDENTIFICAÇÃO DO MODELO OBJETO DA CERTIFICAÇÃO"]
[]
[null,"MODELO:",null,null,"-"]
[null,"MARCA(S):",null,null,"-"]
[null,"NOME COMERCIAL:",null,null,"-"]
[null,"CÓDIGO DO FABRICANTE:",null,null,"-"]
[]
[null,{"$f":"IF(SOLICITAÇÃO!C5=\"MODELO 1b - LOTE\",\"IDENTIFICAÇÃO LOTE\",\"\")","v":""},null,null,{"$f":"IF(SOLICITAÇÃO!C5=\"MODELO 1b - LOTE\",\"QUANTIDADE DO LOTE\",\"\")","v":""},null,null,{"$f":"IF(SOLICITAÇÃO!C5=\"MODELO 1b - LOTE\",\"N° DO LOTE DE FABRICAÇÃO\",\"\")","v":""},null,null,{"$f":"IF(SOLICITAÇÃO!C5=\"MODELO 1b - LOTE\",\"LI/LPCO/DI/DUIMP\",\"\")","v":""},null,null,{"$f":"IF(SOLICITAÇÃO!C5=\"MODELO 1b - LOTE\",\"N° DO EDITAL\",\"\")","v":""}]
[]
[]
[null,"COR/VERSÕES E CÓDIGO DE BARRAS"]
[]
[null,1,{"$f":"VLOOKUP(B14,'Cor - Versões - Código de Barra'!$B$3:$D$17,2,0)","v":"-"},null,4,{"$f":"VLOOKUP(E14,'Cor - Versões - Código de Barra'!$B$3:$D$17,2,0)","v":"-"},null,7,{"$f":"VLOOKUP(H14,'Cor - Versões - Código de Barra'!$B$3:$D$17,2,0)","v":"-"},null,10,{"$f":"VLOOKUP(K14,'Cor - Versões - Código de Barra'!$B$3:$D$17,2,0)","v":"-"},null,13,{"$f":"VLOOKUP(N14,'Cor - Versões - Código de Barra'!$B$3:$D$17,2,0)","v":"-"}]
[null,null,{"$f":"VLOOKUP(B14,'Cor - Versões - Código de Barra'!$B$3:$D$17,3,0)","v":"-"},null,null,{"$f":"VLOOKUP(E14,'Cor - Versões - Código de Barra'!$B$3:$D$17,3,0)","v":"-"},null,null,{"$f":"VLOOKUP(H14,'Cor - Versões - Código de Barra'!$B$3:$D$17,3,0)","v":"-"},null,null,{"$f":"VLOOKUP(K14,'Cor - Versões - Código de Barra'!$B$3:$D$17,3,0)","v":"-"},null,null,{"$f":"VLOOKUP(N14,'Cor - Versões - Código de Barra'!$B$3:$D$17,3,0)","v":"-"}]
[]
[null,2,{"$f":"VLOOKUP(B17,'Cor - Versões - Código de Barra'!$B$3:$D$17,2,0)","v":"-"},null,5,{"$f":"VLOOKUP(E17,'Cor - Versões - Código de Barra'!$B$3:$D$17,2,0)","v":"-"},null,8,{"$f":"VLOOKUP(H17,'Cor - Versões - Código de Barra'!$B$3:$D$17,2,0)","v":"-"},null,11,{"$f":"VLOOKUP(K17,'Cor - Versões - Código de Barra'!$B$3:$D$17,2,0)","v":"-"},null,14,{"$f":"VLOOKUP(N17,'Cor - Versões - Código de Barra'!$B$3:$D$17,2,0)","v":"-"}]
[null,null,{"$f":"VLOOKUP(B17,'Cor - Versões - Código de Barra'!$B$3:$D$17,3,0)","v":"-"},null,null,{"$f":"VLOOKUP(E17,'Cor - Versões - Código de Barra'!$B$3:$D$17,3,0)","v":"-"},null,null,{"$f":"VLOOKUP(H17,'Cor - Versões - Código de Barra'!$B$3:$D$17,3,0)","v":"-"},null,null,{"$f":"VLOOKUP(K17,'Cor - Versões - Código de Barra'!$B$3:$D$17,3,0)","v":"-"},null,null,{"$f":"VLOOKUP(N17,'Cor - Versões - Código de Barra'!$B$3:$D$17,3,0)","v":"-"}]
[]
[null,3,{"$f":"VLOOKUP(B20,'Cor - Versões - Código de Barra'!$B$3:$D$17,2,0)","v":"-"},null,6,{"$f":"VLOOKUP(E20,'Cor - Versões - Código de Barra'!$B$3:$D$17,2,0)","v":"-"},null,9,{"$f":"VLOOKUP(H20,'Cor - Versões - Código de Barra'!$B$3:$D$17,2,0)","v":"-"},null,12,{"$f":"VLOOKUP(K20,'Cor - Versões - Código de Barra'!$B$3:$D$17,2,0)","v":"-"},null,15,{"$f":"VLOOKUP(N20,'Cor - Versões - Código de Barra'!$B$3:$D$17,2,0)","v":"-"}]
[null,null,{"$f":"VLOOKUP(B20,'Cor - Versões - Código de Barra'!$B$3:$D$17,3,0)","v":"-"},null,null,{"$f":"VLOOKUP(E20,'Cor - Versões - Código de Barra'!$B$3:$D$17,3,0)","v":"-"},null,null,{"$f":"VLOOKUP(H20,'Cor - Versões - Código de Barra'!$B$3:$D$17,3,0)","v":"-"},null,null,{"$f":"VLOOKUP(K20,'Cor - Versões - Código de Barra'!$B$3:$D$17,3,0)","v":"-"},null,null,{"$f":"VLOOKUP(N20,'Cor - Versões - Código de Barra'!$B$3:$D$17,3,0)","v":"-"}]
[]
[]
[]
[]
[]
[null,"CARACTERÍSTICAS CONSTRUTIVAS - COMPOSIÇÃO"]
[]
[null,"Tipo de berço:",null,null,null,"-",null,"Berço tipo 1: berços declaradamente construídos para uso de crianças com capacidade motora para sentar-se, ajoelhar-se e/ou levantar-se sozinhas, porém que ainda não sejam capazes de escalar o berço, incluindo também os berços de bases ajustáveis que podem ser utilizados em posições exclusivas para recém-nascidos, como também por crianças maiores – desde que ainda não sejam capazes de escalar o berço.\nBerço tipo 2: berços declaradamente construídos para uso de crianças que ainda não sentam, ajoelham ou levantam sozinhas."]
[null,"Material",null,null,null,"-"]
[null,"Dimensões (mm):",null,null,null,"-"]
[null,"O berço é de balanço ou de movimento\npendular?",null,null,null,"-"]
[null,"Sistema de travamento",null,null,null,"-",null,null,null,null,{"$f":"IF(F33=\"Outros:\",\"Qual:\",\"\")","v":""}]
[null,"Sistema de Montagem/Ferragem ",null,null,null,"-",null,null,null,null,{"$f":"IF(F34=\"Outros:\",\"Qual:\",\"\")","v":""}]
[]
[null,"ACESSÓRIOS"]
[]
[null,"No caso de o berço infantil conter algum acessório, descrever sucintamente quais são os acessórios, o material empregado e as versões correspondentes."]
[]
[null,null,"Acessórios",null,null,null,null,null,"Material (Acessório)",null,null,"Versões (Acessório)"]
[null,1,null,{"$f":"IF(C41=\"Outros:\",\"Qual:\",\"\")","v":""}]
[null,2,null,{"$f":"IF(C42=\"Outros:\",\"Qual:\",\"\")","v":""}]
[null,3,null,""]
[null,4,null,""]
[null,5,null,""]
[null,6,null,""]
[null,7,null,""]
[null,8,null,""]
[]
[null,"DESENHO DO PRODUTO"]
[]
[null,"EXEMPLO","Exemplo (Imagem meramente ilustrativa)",null,null,null,"Favor inserir imagens de 800x600 dpi - mínimo",null,null,null,"DESENHO DO PRODUTO (CLIENTE):","-"]
[]
[]
[]
[]
[]
[]
[]
[]
[]
[]
[null,"RELAÇÃO DE INSUMOS\nInsumos podem ser as laterais, extremidades, base do berço, base do berço dobrável, parafusos e afins, tintas utilizadas e todos os demais componentes utilizados para a construção do berço que impactem a conformidade do produto quanto à migração de elementos tóxicos, inflamabilidade e deterioração e ataque de insetos, sejam fornecidos por empresa terceira ou produzidos pela própria empresa fabricante do produto final."]
[]
[null,"Obrigatório o preenchimento da tabela abaixo."]
[]
[null,"INSUMO",null,null,null,"MATERIAIS UTILIZADOS",null,null,null,null,"FORNECEDOR(ES)"]
[null,"-",null,null,null,"-",null,null,null,null,"-"]
[null,"-",null,null,null,"-",null,null,null,null,"-"]
[null,"-",null,null,null,"-",null,null,null,null,"-"]
[null,"-",null,null,null,"-",null,null,null,null,"-"]
[null,"-",null,null,null,"-",null,null,null,null,"-"]
[null,"-",null,null,null,"-",null,null,null,null,"-"]
[null,"-",null,null,null,"-",null,null,null,null,"-"]
[null,"-",null,null,null,"-",null,null,null,null,"-"]
[null,"-",null,null,null,"-",null,null,null,null,"-"]
[null,"-",null,null,null,"-",null,null,null,null,"-"]
[null,"-",null,null,null,"-",null,null,null,null,"-"]
[]
[null,"POSICIONAMENTO DAS MARCAÇÕES OBRIGATÓRIAS:"]
{"$rows_left_out":26}
{"sheet":"REPASSE ","index":2,"n_rows":28,"n_cols":3,"rows_kept":28,"cut":false,"hidden":true,"merged":[[27,1,31,1],[27,2,31,4],[9,2,9,4],[10,2,10,4],[11,2,11,4],[12,2,12,4],[13,2,13,4],[14,2,14,4],[15,2,15,4],[16,2,16,4],[18,2,18,4],[19,2,19,4],[21,2,21,4],[8,2,8,4],[1,1,1,4],[3,1,3,4],[5,2,5,4],[6,2,6,4],[7,2,7,4]]}
[]
[null,"                                \n                                 ANÁLISE DE VIABILIDADE - BERÇO\n                 \n                               "]
[]
[null,"DADOS DO EMBALADOR - (Somente em caso de repasse)"]
[]
[null,"RAZÃO SOCIAL:","-"]
[null,"NOME FANTASIA:","-"]
[null,"CNPJ:","-"]
[null,"ENDEREÇO:","-"]
[null,"BAIRRO:","-"]
[null,"CEP:","-"]
[null,"CIDADE:","-"]
[null,"ESTADO:","-"]
[null,"E-MAIL:","-"]
[null,"NOME DO CONTATO:","-"]
[null,"TELEFONE: (   )","-"]
[null,"DATA DA SOLICITAÇÃO:","-"]
[]
[null,"N° AUTORIZAÇÃO PARTICULAR DE REPASSE:","-"]
[null,"N° AUTORIZAÇÃO DE USO DA MARCA:","-"]
[]
[null,"N° DE LICENÇA DE IMPORTAÇÃO:","-"]
[]
[null,"PROCEDÊNCIA: ","-"]
[null,{"$f":"IF(C24=\"IMPORTADO\",\"PAÍS DE ORIGEM:\",\"\")","v":""},"-"]
[null,{"$f":"IF(C24=\"IMPORTADO\",\"N° DA LICENÇA DE IMPORTAÇÃO\",\"-\")","v":"-"},"-"]
[]
[null,null,"______________________________________________________________________\nAssinatura (obrigatório)\n"]

{"sheet":"Plan2","index":3,"n_rows":15,"n_cols":7,"rows_kept":15,"cut":false,"hidden":true,"merged":[]}
["-","-","-","-","-"]
["Tipo 1 ","Barra de balanço","Força de 50N para liberação","Manual (sem ferramenta)","Sim","-","-"]
["Tipo 2","Barras laterais para mini-berço","Duas ações consecutivas","Manual (com ferramenta)","Não","MODELO 2","INICIAL"]
["Tipo 1 e Tipo 2","Bolsa de transporte","Duas ações simultâneas","Outros:",null,"MODELO 5","MANUTENÇÃO"]
[null,"Cama","Dois dispositivos de operação separados por uma distância de, pelo menos, 850mm e serem operados simultaneamente.",null,null,"MODELO 1b - LOTE","INCLUSÃO / REVISÃO"]
[null,"Capota","Base do berço seja levantada para permitir o dobramento do berço, no caso de dobráveis",null,null,null,"RECERTIFICAÇÃO"]
[null,"Colchão","N/A",null,null,null,"TRANSFERÊNCIA"]
[null,"Gaveta","Outros:"]
[null,"Mobile"]
[null,"Mosquiteiro"]
[null,"Porta objeto"]
[null,"Rodízio com trava"]
[null,"Rodízio sem trava"]
[null,"Trocador"]
[null,"Outros:"]

{"sheet":"Cor - Versões - Código de Barra","index":4,"n_rows":18,"n_cols":4,"rows_kept":18,"cut":false,"hidden":false,"merged":[]}
[]
[null,null,"COR/VERSÕES"," CÓDIGO DE BARRAS"]
[null,1,"-","-"]
[null,2,"-","-"]
[null,3,"-","-"]
[null,4,"-","-"]
[null,5,"-","-"]
[null,6,"-","-"]
[null,7,"-","-"]
[null,8,"-","-"]
[null,9,"-","-"]
[null,10,"-","-"]
[null,11,"-","-"]
[null,12,"-","-"]
[null,13,"-","-"]
[null,14,"-","-"]
[null,15,"-","-"]
[null,null,"-",123123132132]

{"sheet":"PLANO DE ENSAIO","index":5,"n_rows":96,"n_cols":8,"rows_kept":96,"cut":false,"hidden":true,"merged":[[95,7,95,9],[93,2,93,4],[94,2,94,4],[95,2,95,4],[37,1,37,9],[39,2,39,4],[39,7,39,9],[41,2,41,4],[41,7,41,9],[40,2,40,4],[91,1,92,1],[91,2,92,4],[91,5,91,6],[91,7,92,9],[93,7,93,9],[94,7,94,9],[88,2,88,4],[89,2,89,4],[90,1,90,9],[71,1,72,1],[71,2,72,4],[71,5,71,6],[71,7,72,9],[82,2,82,4],[83,2,83,4],[84,2,84,4],[85,2,85,4],[86,2,86,4],[87,2,87,4],[89,7,89,9],[73,2,73,4],[74,2,74,4],[75,2,75,4],[76,2,76,4],[77,2,77,4],[78,2,78,4],[79,2,79,4],[80,2,80,4],[81,2,81,4],[83,7,83,9],[84,7,84,9],[85,7,85,9],[86,7,86,9],[87,7,87,9],[88,7,88,9],[77,7,77,9],[78,7,78,9],[79,7,79,9],[80,7,80,9],[81,7,81,9],[82,7,82,9],[69,7,69,9],[70,1,70,9],[73,7,73,9],[74,7,74,9],[75,7,75,9],[76,7,76,9],[63,7,63,9],[64,7,64,9],[65,7,65,9],[66,7,66,9],[67,7,67,9],[68,7,68,9],[57,7,57,9],[58,7,58,9],[59,7,59,9],[60,7,60,9],[61,7,61,9],[62,7,62,9],[51,7,51,9],[52,7,52,9],[53,7,53,9],[54,7,54,9],[55,7,55,9],[56,7,56,9],[58,2,58,4],[60,2,60,4],[59,2,59,4],[61,2,61,4],[62,2,62,4],[63,2,63,4],[64,2,64,4],[65,2,65,4],[66,2,66,4],[67,2,67,4],[68,2,68,4],[69,2,69,4],[56,2,56,4],[51,2,51,4],[53,2,53,4],[52,2,52,4],[54,2,54,4],[55,2,55,4],[57,2,57,4],[21,6,22,9],[40,7,40,9],[21,5,22,5],[34,1,34,2],[34,3,34,4],[34,5,34,9],[35,1,35,2],[35,3,35,4],[35,5,35,9],[32,1,32,2],[32,3,32,4],[32,5,32,9],[33,1,33,2],[33,3,33,4],[33,5,33,9],[30,1,30,2],[30,3,30,4],[30,5,30,9],[31,1,31,2],[31,3,31,4],[31,5,31,9],[28,1,28,2],[28,3,28,4],[28,5,28,9],[29,1,29,2],[29,3,29,4],[29,5,29,9],[26,1,26,2],[26,3,26,4],[26,5,26,9],[27,1,27,2],[27,3,27,4],[27,5,27,9],[24,1,24,2],[24,3,24,4],[24,5,24,9],[25,1,25,2],[25,3,25,4],[25,5,25,9],[20,6,20,9],[23,1,23,9],[49,2,49,4],[49,7,49,9],[50,2,50,4],[50,7,50,9],[15,6,15,9],[16,6,16,9],[17,6,17,9],[18,6,18,9],[19,6,19,9],[47,2,47,4],[47,7,47,9],[48,2,48,4],[48,7,48,9],[45,2,45,4],[45,7,45,9],[46,2,46,4],[46,7,46,9],[36,1,36,9],[42,1,42,9],[38,2,38,4],[38,7,38,9],[43,2,44,4],[43,1,44,1],[43,5,43,6],[43,7,44,9],[17,1,17,2],[17,3,17,4],[18,1,22,2],[18,3,22,4],[13,1,13,9],[14,1,14,4],[14,5,14,9],[15,1,15,2],[15,3,15,4],[16,1,16,2],[16,3,16,4],[11,1,11,2],[11,3,11,4],[11,6,11,9],[12,1,12,2],[12,3,12,4],[12,6,12,9],[8,1,8,2],[8,3,8,9],[9,1,9,2],[9,3,9,4],[9,6,9,9],[10,1,10,2],[10,3,10,4],[10,6,10,9],[5,1,5,2],[6,1,6,2],[6,3,6,9],[7,1,7,2],[7,3,7,9],[5,3,5,9],[1,1,2,5],[1,6,1,9],[2,7,2,9],[3,1,3,9],[4,1,4,2],[4,3,4,9]]}
[]
[null,"                            PLANO DE ENSAIOS PARA BERÇOS",null,null,null,null,"FOR.4.2"]
[null,null,null,null,null,null,"REV.00","2025-07-28"]
[null,"IDENTIFICAÇÃO DO SOLICITANTE"]
[null,"Razão Social: (Solicitante)",null,{"$f":"SOLICITAÇÃO!C11","v":"-"}]
[null,"Endereço: (Solicitante)",null,{"$f":"SOLICITAÇÃO!C14&\" - \"&SOLICITAÇÃO!C15&\" - \"&SOLICITAÇÃO!C17&\" - \"&SOLICITAÇÃO!C18&\" - \"&SOLICITAÇÃO!C16","v":"- - - - - - - - -"}]
[null,"CNPJ: (Solicitante)",null,{"$f":"SOLICITAÇÃO!C13","v":"-"}]
[null,"Fabricante:",null,{"$f":"SOLICITAÇÃO!C27","v":"-"}]
[null,"Portaria/Normas:",null,"PORTARIA Nº 143, DE 22 DE MARÇO DE 2021 - Aprova o Regulamento Técnico da Qualidade e os Requisitos de Avaliação da Conformidade para Berços Infantis - Consolidado / ABNT NBR 15860-1:2016 Móveis - Berços e berços dobráveis infantis tipo doméstico - Parte 1: Requisitos de segurança. / ABNT NBR 15860-2:2016 Móveis - Berços e berços dobráveis infantis tipo doméstico - Parte 2: Métodos de ensaio. / ABNT NBR 16067-1:2012 Móveis - Berços, berços de balanço ou pendular de até 900 mm para uso doméstico - Parte 1: Requisitos de segurança. / ABNT NBR 16067-2:2012 Móveis - Berços, berços de balanço ou pendular de até 900 mm para uso doméstico - Parte 2: Métodos de ensaio."]
[null,"Rastreabilidade da amostra:",null,null,null,"Quantidade de amostras"]
[null,"Modelo de certificação:",null,{"$f":"SOLICITAÇÃO!C5","v":"-"},null,"Tipo de amostra:","Escolher um item."]
[null,"Tipo Amostragem:",null,"Escolher um item.",null,"Processo: (Evento)"]
[null,"Técnico responsável:",null,null,null,"Data:"]
[null,"IDENTIFICAÇÃO DA AMOSTRA"]
[null,"Identificação do modelo ",null,null,null,"Características construtivas"]
[null,"Modelo:",null,{"$f":"'MEMORIAL DESCRITIVO'!E4","v":"-"},null,"TIPO DE BERÇO:",{"$f":"'MEMORIAL DESCRITIVO'!F29","v":"-"}]
[null,"Marca:",null,{"$f":"'MEMORIAL DESCRITIVO'!E5","v":"-"},null,"MATERIAL: ",{"$f":"'MEMORIAL DESCRITIVO'!F30","v":"-"}]
[null,"Nome comercial:",null,{"$f":"'MEMORIAL DESCRITIVO'!E6","v":"-"},null,"DIMENSÕES:(mm)",{"$f":"'MEMORIAL DESCRITIVO'!F31","v":"-"}]
[null,"Foto do produto:",null,null,null,"SISTEMA DE TRAVAMENTO:",{"$f":"'MEMORIAL DESCRITIVO'!F33","v":"-"}]
[null,null,null,null,null,"SISTEMA DE MONTAGEM/FERRAGEM:",{"$f":"'MEMORIAL DESCRITIVO'!F34","v":"-"}]
[null,null,null,null,null,"BERÇO DE BALANÇO OU MOVIMENTO PENDULAR?",{"$f":"'MEMORIAL DESCRITIVO'!F32","v":"-"}]
[null,null,null,null,null,"ACESSÓRIOS:",{"$f":"_xlfn.TEXTJOIN(\" / \", TRUE, IF((ISERROR(FIND(\"Outros:\", 'MEMORIAL DESCRITIVO'!C41:F48)) * ISERROR(FIND(\"Qual:\", 'MEMORIAL DESCRITIVO'!C41:F48))) * ('MEMORIAL DESCRITIVO'!C41:F48<>\"\"), 'MEMORIAL DESCRITIVO'!C41:F48, \"\"))","v":""}]
[]
[null,"INSUMOS"]
[null,"INSUMOS",null,"MATERIAIS UTILIZADOS",null,"FORNECEDORES"]
[null,{"$f":"'MEMORIAL DESCRITIVO'!B68","v":"-"},null,{"$f":"'MEMORIAL DESCRITIVO'!F68","v":"-"},null,{"$f":"'MEMORIAL DESCRITIVO'!K68","v":"-"}]
[null,{"$f":"'MEMORIAL DESCRITIVO'!B69","v":"-"},null,{"$f":"'MEMORIAL DESCRITIVO'!F69","v":"-"},null,{"$f":"'MEMORIAL DESCRITIVO'!K69","v":"-"}]
[null,{"$f":"'MEMORIAL DESCRITIVO'!B70","v":"-"},null,{"$f":"'MEMORIAL DESCRITIVO'!F70","v":"-"},null,{"$f":"'MEMORIAL DESCRITIVO'!K70","v":"-"}]
[null,{"$f":"'MEMORIAL DESCRITIVO'!B71","v":"-"},null,{"$f":"'MEMORIAL DESCRITIVO'!F71","v":"-"},null,{"$f":"'MEMORIAL DESCRITIVO'!K71","v":"-"}]
[null,{"$f":"'MEMORIAL DESCRITIVO'!B72","v":"-"},null,{"$f":"'MEMORIAL DESCRITIVO'!F72","v":"-"},null,{"$f":"'MEMORIAL DESCRITIVO'!K72","v":"-"}]
[null,{"$f":"'MEMORIAL DESCRITIVO'!B73","v":"-"},null,{"$f":"'MEMORIAL DESCRITIVO'!F73","v":"-"},null,{"$f":"'MEMORIAL DESCRITIVO'!K73","v":"-"}]
[null,{"$f":"'MEMORIAL DESCRITIVO'!B74","v":"-"},null,{"$f":"'MEMORIAL DESCRITIVO'!F74","v":"-"},null,{"$f":"'MEMORIAL DESCRITIVO'!K74","v":"-"}]
[null,{"$f":"'MEMORIAL DESCRITIVO'!B75","v":"-"},null,{"$f":"'MEMORIAL DESCRITIVO'!F75","v":"-"},null,{"$f":"'MEMORIAL DESCRITIVO'!K75","v":"-"}]
[null,{"$f":"'MEMORIAL DESCRITIVO'!B76","v":"-"},null,{"$f":"'MEMORIAL DESCRITIVO'!F76","v":"-"},null,{"$f":"'MEMORIAL DESCRITIVO'!K76","v":"-"}]
[null,{"$f":"'MEMORIAL DESCRITIVO'!B77","v":"-"},null,{"$f":"'MEMORIAL DESCRITIVO'!F77","v":"-"},null,{"$f":"'MEMORIAL DESCRITIVO'!K77","v":"-"}]
[null,{"$f":"'MEMORIAL DESCRITIVO'!B78","v":"-"},null,{"$f":"'MEMORIAL DESCRITIVO'!F78","v":"-"},null,{"$f":"'MEMORIAL DESCRITIVO'!K78","v":"-"}]
[null,"ENSAIOS"]
[null,"Tabela 1. Ensaios nos insumos"]
[null,"4.4 e 4.12","Migração de certos elementos",null,null,"ABNT NBR 15860-1","4.2.1","Escolher um item."]
[null,"4.4 e 4.11","Determinação de pentaclorofenol e derivados",null,null,"NM 300-1","5.24","Escolher um item."]
[null,"4.4 e 4.13","Inflamabilidade",null,null,"ABNT NBR 15860-1","4.2.2","Escolher um item."]
[null,"4.14  ","Resistência à corrosão por exposição à névoa salina  ",null,null,"ABNT NBR 16067-1  ","4.1.3  ","Escolher um item."]
[null,"Tabela 2. Ensaios e itens de inspeção visual para berços tipo 1"]
[null,"Requisito do RTQ","Ensaios",null,null,"Procedimento",null,"Execução?"]
[null,null,null,null,null,"Base Normativa","Item"]
[null,"4.4 e 4.10","Ensaio de bordas cortantes",null,null,"NM 300-1","5.8","Escolher um item."]
[null,"4.4 e 4.10","Ensaio de pontas agudas",null,null,"NM 300-1","5.9","Escolher um item."]
[null,"4.4 e 4.11","Determinação de pentaclorofenol e derivados*",null,null,"NM 300-1","5.24","Escolher um item."]
[null,"4.4 e 4.12","Migração de certos elementos",null,null,"ABNT NBR 15860-1","4.2.1","Escolher um item."]
[null,"4.4 e 4.13","Inflamabilidade*",null,null,"ABNT NBR 15860-1","4.2.2","Escolher um item."]
[null,"4.15","Pontos de apoio",null,null,"ABNT NBR 15860-2","5.2","Escolher um item."]
[null,"4.16","Medições de furos, espaços e aberturas no lado interno",null,null,"ABNT NBR 15860-2","5.3.1","Escolher um item."]
[null,"4.16","Medições de furos, espaços e aberturas no lado externo",null,null,"ABNT NBR 15860-2","5.3.2","Escolher um item."]
[null,"4.4 e 4.19","Peças pequenas – torque",null,null,"ABNT NBR 15860-2","5.4.2","Escolher um item."]
[null,"4.4 e 4.19","Peças pequenas – tensão",null,null,"ABNT NBR 15860-2","5.4.3","Escolher um item."]
[null,"4.20","Mordida",null,null,"ABNT NBR 15860-2","5.5","Escolher um item."]
[null,"4.21","Resistência da base do berço e do colchão",null,null,"ABNT NBR 15860-2","5.6","Escolher um item."]
[null,"4.21","Carga estática das ripas laterais",null,null,"ABNT NBR 15860-2","5.7.1","Escolher um item."]
[null,"4.21","Resistência das laterais ou ripas laterais",null,null,"ABNT NBR 15860-2","5.7.2","Escolher um item."]
[null,"4.21","Resistência dos cantos",null,null,"ABNT NBR 15860-2","5.7.3","Escolher um item."]
[null,"4.21","Resistência da tela e laterais flexíveis e extremidades",null,null,"ABNT NBR 15860-2","5.7.4","Escolher um item."]
[null,"4.9 - c; 4.21","Carga estática vertical da estrutura e elementos de fixação",null,null,"ABNT NBR 15860-2","5.8.1","Escolher um item."]
[null,"4.22","Durabilidade da estrutura e elementos de fixação",null,null,"ABNT NBR 15860-2","5.8.2","Escolher um item."]
[null,"4.23","Espaçamento entre a base para berço dobrável e/ou colchão e as laterais e extremidades do berço",null,null,"ABNT NBR 15860-2","5.12","Escolher um item."]
[null,"4.23","Espaço entre o colchão e as laterais ou extremidades",null,null,"ABNT NBR 15860-2","5.13","Escolher um item."]
[null,"4.24","Pontos salientes",null,null,"ABNT NBR 15860-2","5.9","Escolher um item."]
[null,"4.25","Estabilidade",null,null,"ABNT NBR 15860-2","5.10","Escolher um item."]
[null,"4.7 - a; 4.26","Durabilidade dos mecanismos de travamento",null,null,"ABNT NBR 15860-2","5.11.1","Escolher um item."]
[null,"4.26","Resistência dos mecanismos de travamento",null,null,"ABNT NBR 15860-2","5.11.2","Escolher um item."]
[null,"4.28","Embalagem",null,null,"NM 300-1","4.10 / 5.10","Escolher um item."]
[null,"Tabela 3. Ensaios e itens de inspeção visual para berços tipo 2"]
[null,"Requisito do RTQ","Ensaios",null,null,"Procedimento",null,"Execução?"]
[null,null,null,null,null,"Base Normativa","Item"]
[null,"4.4; 4.10","Ensaio de bordas cortantes  ",null,null,"NM 300-1  ","5.8  ","Escolher um item."]
[null,"4.4; 4.10","Ensaio de pontas agudas  ",null,null,"NM 300-1  ","5.9  ","Escolher um item."]
[null,"4.4; 4.11","Determinação de pentaclorofenol e derivados*  ",null,null,"NM 300-1  ","5.24  ","Escolher um item."]
[null,"4.4; 4.12","Migração de certos elementos  ",null,null,"ABNT NBR 16067-1  ","4.1.2  ","Escolher um item."]
[null,"4.4; 4.13","Inflamabilidade*",null,null,"ABNT NBR 15860-1  ","4.2.2  ","Escolher um item."]
[null,"4.15","Medição da altura dos lados  ",null,null,"ABNT NBR 16067-2  ","5.3.1  ","Escolher um item."]
[null,"4.17","Medição dos furos e distância entre elementos estruturais, fios da tela, espaçamento entre a base e as laterais e as extremidades  ",null,null,"ABNT NBR 16067-2  ","5.3.2  ","Escolher um item."]
{"$rows_left_out":16}